Other Specialty Food Retailers
type: Class
subclass of: jmusMEBeQCyl2udlUWSwdQ
definition: This industry comprises establishments primarily engaged in retailing specialty foods (except fruits and vegetables, meat, fish, and seafood) not for immediate consumption and not made on the premises.
example: Baked goods (not made on premises) retailers
example: Coffee and tea (i.e., packaged) retailers
example: Confectionery (i.e., packaged) retailers
example: Dairy product retailers
example: Gourmet food retailers
example: Nut (i.e., packaged) retailers