All Other Miscellaneous Wood Product Manufacturing
type: Class
subclass of: fOPbREAsSIarGeJiYAaoiw
definition: This U.S. industry comprises establishments primarily engaged in manufacturing wood products (except establishments operating sawmills and preservation facilities; establishments manufacturing veneer, engineered wood products, millwork, wood containers, pallets, and wood container parts; and establishments making manufactured homes (i.e., mobile homes) and prefabricated buildings and components).
example: Cabinets (i.e., housings), wood (e.g., sewing machines, stereo, television), manufacturing
example: Cork products (except gaskets) manufacturing
example: Kiln drying lumber
example: Shoe trees manufacturing
example: Wood dowels manufacturing
example: Wood extension ladders manufacturing
example: Wood handles (e.g., broom, handtool, mop), manufacturing
example: Wood kitchenware manufacturing
example: Wood stepladders manufacturing
example: Wood toilet seats manufacturing
example: Wood toothpicks manufacturing