All Other Health and Personal Care Retailers
type: Class
subclass of: u3vWIxTJSVuTaMFWrzwtCw
definition: This U.S. industry comprises establishments primarily engaged in retailing specialized lines of health and personal care merchandise (except drugs, medicines, cosmetics, beauty supplies, perfumes, optical goods, and food supplement products).
example: Convalescent supply retailers
example: Hearing aid retailers
example: Sick room supply retailers
example: Wheelchair retailers