Elevator and Moving Stairway Manufacturing
type: Class
subclass of: HNVzadjSQGur0qgpX0Smbw
definition: This U.S. industry comprises establishments primarily engaged in manufacturing elevators and moving stairways.
example: Automobile lifts (i.e., garage-type, service station) manufacturing
example: Escalators manufacturing
example: Moving walkways manufacturing
example: Passenger and freight elevators manufacturing