Marketing Research and Public Opinion Polling
type: Class
subclass of: L4gqVqvURi65vVtSvo56fA
definition: This industry comprises establishments primarily engaged in systematically gathering, recording, tabulating, and presenting marketing and public opinion data.
example: Broadcast media rating services
example: Marketing analysis or research services
example: Opinion research services
example: Political opinion polling services
example: Statistical sampling services