Coal and Other Mineral and Ore Merchant Wholesalers
type: Class
subclass of: fmFb3jrwR3irrf0drKW13g
definition: This industry comprises establishments primarily engaged in the merchant wholesale distribution of coal, coke, metal ores, and/or nonmetallic minerals (except precious and semiprecious stones and minerals used in construction, such as sand and gravel).