Custom Compounding of Purchased Resins
type: Class
subclass of: kyN-KUDNTweyrC4jbi9QXw
definition: This U.S. industry comprises establishments primarily engaged in (1) custom mixing and blending plastics resins made elsewhere or (2) reformulating plastics resins from recycled plastics products.