Radio and Television Broadcasting and Wireless Communications Equipment Manufacturing
type: Class
subclass of: OE8w81VSSHefP3ImZb4BFw
definition: This industry comprises establishments primarily engaged in manufacturing radio and television broadcast and wireless communications equipment. Examples of products made by these establishments are transmitting and receiving antennas, cable television equipment, GPS equipment, pagers, cellular phones, mobile communications equipment, and radio and television studio and broadcasting equipment.