Steam and Air-Conditioning Supply
type: Class
subclass of: adQcOuLaTMu96ErMjMF2 g
definition: This industry comprises establishments primarily engaged in providing steam, heated air, or cooled air. The steam distribution may be through mains.