Custom Roll Forming
type: Class
subclass of: fD3HEmIjTCWjYGdG9M1m2g
definition: This U.S. industry comprises establishments primarily engaged in custom roll forming metal products by use of rotary motion of rolls with various contours to bend or shape the products.