Wood Container and Pallet Manufacturing
type: Class
subclass of: uX98XSUsQwqyaNFuyn-5Gg
definition: This industry comprises establishments primarily engaged in manufacturing wood pallets, wood box shook, wood boxes, other wood containers, and wood parts for pallets and containers.