Petroleum and Petroleum Products Merchant Wholesalers (except Bulk Stations and Terminals)
type: Class
subclass of: PLFHrXcUTWaEpQVWyTCBAw
definition: This industry comprises establishments primarily engaged in the merchant wholesale distribution of petroleum and petroleum products (except from bulk liquid storage facilities).
example: Bottled liquid petroleum gas merchant wholesalers
example: Fuel oil merchant wholesalers (except bulk stations, terminals)
example: Gasoline merchant wholesalers (except bulk stations, terminals)
example: Lubricating oil and grease merchant wholesalers (except bulk stations, terminals)