Credit Card Issuing Industry
type: Class
subclass of: NSuHU9KfQAyMsU7Yjh1k1g
definition: This industry comprises establishments primarily engaged in providing credit by issuing credit cards. Credit card issuance provides the funds required to purchase goods and services in return for payment of the full balance or payments on an installment basis. Credit card banks are included in this industry.