Switchgear and Switchboard Apparatus Manufacturing
type: Class
subclass of: 4iufljqCQa60MT3qIwSssA
definition: This U.S. industry comprises establishments primarily engaged in manufacturing switchgear and switchboard apparatus.
example: Circuit breakers, power, manufacturing
example: Control panels, electric power distribution, manufacturing
example: Ducts for electrical switchboard apparatus manufacturing
example: Fuses, electric, manufacturing
example: Power switching equipment manufacturing
example: Switches, electric power (except pushbutton, snap, solenoid, tumbler), manufacturing