Office Supplies (except Paper) Manufacturing
type: Class
subclass of: Wdrm5x7Rze9MtqOCstr9Q
definition: This industry comprises establishments primarily engaged in manufacturing office supplies. Examples of products made by these establishments are pens, pencils, felt tip markers, crayons, chalk, pencil sharpeners, staplers, modeling clay, hand operated stamps, stamp pads, stencils, carbon paper, and inked ribbons.