Packaged Frozen Food Merchant Wholesalers
type: Class
subclass of: iRMo1yJkTOOh2tWGMHrz2g
definition: This industry comprises establishments primarily engaged in the merchant wholesale distribution of packaged frozen foods (except dairy products).
example: Frozen bakery products merchant wholesalers
example: Frozen juices merchant wholesalers
example: Frozen vegetables merchant wholesalers
example: Packaged frozen fish merchant wholesalers
example: Packaged frozen meats merchant wholesalers
example: Packaged frozen poultry merchant wholesalers