Other Publishers
type: Class
subclass of: 8BwYq- yQ3mh7EwIjEuPzA
definition: This industry comprises establishments known as publishers (except newspaper, magazine, book, directory, mailing list, music, and software publishers). These establishments may publish works in print or electronic form, including exclusively on the Internet.
example: Art publishers
example: Calendar publishers
example: Greeting card publishers