Other Specialized Design Services
type: Class
subclass of: A8iVr4ckT3SiV4HT6nifnQ
definition: This industry comprises establishments primarily engaged in providing professional design services (except architectural, landscape architecture, engineering, interior, industrial, graphic, and computer systems design).
example: Costume design services (except independent theatrical costume designers)
example: Fashion design services
example: Float design services
example: Jewelry design services
example: Lighting design services
example: Shoe design services
example: Textile design services