Wood Kitchen Cabinet and Countertop Manufacturing
type: Class
subclass of: xuwgH 9JStK5sueegeLIkA
definition: This industry comprises establishments primarily engaged in manufacturing wood or plastics laminated on wood kitchen cabinets, bathroom vanities, and countertops (except freestanding). The cabinets and counters may be made on a stock or custom basis.