Seasoning and Dressing Manufacturing
type: Class
subclass of: bVu-tszYQS2MtoFucM1fZA
definition: This industry comprises establishments primarily engaged in one or more of the following: (1) manufacturing dressings and sauces, such as mayonnaise, salad dressing, vinegar, mustard, horseradish, soy sauce, tartar sauce, Worcestershire sauce, and other prepared sauces (except tomato-based and gravies); (2) manufacturing spices, table salt, seasoning, and flavoring extracts (except coffee and meat), and natural food colorings; and (3) manufacturing dry mix food preparations, such as salad dressing mixes, gravy and sauce mixes, frosting mixes, and other dry mix preparations.