Other Grain Farming
type: Class
subclass of: k2PELw1fQ1Skibbx-oujJg
definition: This industry comprises establishments primarily engaged in (1) growing grain(s) and/or producing grain seeds (except wheat, corn, and rice) or (2) growing a combination of grain(s) and oilseed(s) with no one grain (or family of grains) or oilseed (or family of oilseeds) accounting for one-half of the establishment's agricultural production (i.e., value of crops for market). Combination grain(s) and oilseed(s) establishments may produce oilseed(s) and grain(s) seeds and/or grow oilseed(s) and grain(s).
example: Barley farming
example: Milo farming
example: Oat farming
example: Oilseed and grain combination farming
example: Rye farming
example: Sorghum farming
example: Wild rice farming