Packing and Crating
type: Class
subclass of: 49W Qx6KT8OCUdWJDhzZmg
definition: This U.S. industry comprises establishments primarily engaged in packing, crating, and otherwise preparing goods for transportation.