Services to Buildings and Dwellings
type: Class
subclass of: R7Ti8xGiWI5NzMSs5upZUo6
definition: This industry group comprises establishments primarily engaged in one of the following: (1) exterminating and pest control services; (2) janitorial services; (3) landscaping services; (4) carpet and upholstery cleaning services; or (5) other services to buildings and dwellings.