Florists
type: Class
subclass of: 55V1cHHZTnSGwtqbpXkPLA
definition: This industry comprises establishments generally known as florists primarily engaged in retailing cut flowers, floral arrangements, and potted plants grown elsewhere. These establishments may prepare the arrangements they sell.