Industrial Machinery Manufacturing
type: Class
subclass of: 3ODslBVpSLOOs-nRaxGdhw
definition: This industry comprises establishments primarily engaged in manufacturing industrial machinery, such as food and beverage manufacturing machinery, semiconductor manufacturing machinery, sawmill and woodworking machinery (except handheld), machinery for making paper and paper products, printing and binding machinery and equipment, textile making machinery, and machinery for making plastics and rubber products.