Lessors of Other Real Estate Property
type: Class
subclass of: wmQ5m7Q6RPKn6lAaRBmJsQ
definition: This industry comprises establishments primarily engaged in acting as lessors of real estate (except buildings), such as manufactured home (i.e., mobile home) sites, vacant lots, and grazing land.