Glass Container Manufacturing
type: Class
subclass of: iJ-4n9cSQfeie-s prHGQg
definition: This U.S. industry comprises establishments primarily engaged in manufacturing glass packaging, bottling, and canning containers.