Environment, Conservation and Wildlife Organizations
type: Class
subclass of: TfrCYTtGTaCrbhjnoTIUvg
definition: This U.S. industry comprises establishments primarily engaged in promoting the preservation and protection of the environment and wildlife. Establishments in this industry address issues, such as clean air and water; global warming; conserving and developing natural resources, including land, plant, water, and energy resources; and protecting and preserving wildlife and endangered species. These organizations may solicit contributions and offer memberships to support these causes.
example: Animal rights organizations
example: Conservation advocacy organizations
example: Humane societies without animal shelters
example: Natural resource preservation organizations
example: Wildlife preservation organizations