Finish Carpentry Contractors
type: Class
subclass of: TOO3rsi6R -r2fNOcxrKlg
definition: This industry comprises establishments primarily engaged in finish carpentry work. The work performed may include new work, additions, alterations, maintenance, and repairs.
example: Built-in wood cabinets constructed on site
example: Countertop (except ceramic tile or stone), residential-type, installation
example: Door and window frame construction
example: Garage door, residential-type, installation
example: Millwork installation
example: Molding or trim, wood or plastic, installation
example: Paneling installation
example: Prefabricated kitchen and bath cabinet, residential-type, installation
example: Ship joinery contractors
example: Window and door, residential-type, of any material, prefabricated, installation