Special Die and Tool, Die Set, Jig, and Fixture Manufacturing
type: Class
subclass of: tEn-M7tEQwSDoAaEWhntrQ
definition: This U.S. industry comprises establishments, known as tool and die shops, primarily engaged in manufacturing special tools and fixtures, such as cutting dies and jigs.