Fruit and Vegetable Canning
type: Class
subclass of: NIPJw YNRSqLwZq-0Co5QQ
definition: This U.S. industry comprises establishments primarily engaged in manufacturing canned, pickled, and brined fruits and vegetables. Examples of products made in these establishments are canned juices; canned jams and jellies; canned tomato-based sauces, such as catsup, salsa, chili sauce, spaghetti sauce, barbeque sauce, and tomato paste; and pickles, relishes, and sauerkraut.