Mining Machinery and Equipment Manufacturing
type: Class
subclass of: po7JQPlISaeQmRCMKPZDbA
definition: This U.S. industry comprises establishments primarily engaged in (1) manufacturing underground mining machinery and equipment, such as coal breakers, mining cars, core drills, coal cutters, and rock drills, and (2) manufacturing mineral beneficiating machinery and equipment used in surface or underground mines.