Reupholstery and Furniture Repair
type: Class
subclass of: xGga0-7ySTanQyuqvhpFRQ
definition: This industry comprises establishments primarily engaged in one or more of the following: (1) reupholstering furniture; (2) refinishing furniture; (3) repairing furniture; and (4) repairing and restoring furniture.