Power and Communication Line and Related Structures Construction
type: Class
subclass of: p1TGIXdGQI-P1nV grt-zg
definition: This industry comprises establishments primarily engaged in the construction of power lines and towers, power plants, and radio, television, and telecommunications transmitting/receiving towers. The work performed may include new work, reconstruction, rehabilitation, and repairs. Specialty trade contractors are included in this industry if they are engaged in activities primarily related to power and communication line and related structures construction. All structures (including buildings) that are integral parts of power and communication networks (e.g., transmitting towers, substations, and power plants) are included.
example: Alternative energy (e.g., geothermal, ocean wave, solar, wind) structure construction
example: Cellular phone tower construction
example: Co-generation plant construction
example: Communication tower construction
example: Electric light and power plant (except hydroelectric) construction
example: Electric power transmission line and tower construction
example: Nuclear power plant construction
example: Power line stringing
example: Radio transmitting tower construction
example: Satellite receiving station construction
example: Telephone line stringing
example: Transformer station and substation, electric power, construction
example: Underground cable (e.g., fiber optic, electricity, telephone, cable television) laying