Beef Cattle Ranching and Farming
type: Class
subclass of: qiKAMhstTTWejF-zgIk3uA
definition: This U.S. industry comprises establishments primarily engaged in raising cattle (including cattle for dairy herd replacements).