All Other Waste Management Services
type: Class
subclass of: xLHw6gf6RjugSp9uLEXVdw
definition: This industry comprises establishments primarily engaged in waste management services (except waste collection, waste treatment and disposal, remediation, operation of materials recovery facilities, and waste management consulting services).
example: Beach cleaning and maintenance services
example: Cesspool cleaning services
example: Portable toilet renting and/or servicing
example: Pumping (i.e., cleaning) cesspools, portable toilets, or septic tanks
example: Sewer cleaning and rodding services
example: Sewer or storm basin cleanout services