Used Car Dealers
type: Class
subclass of: 4cxOGWKKSOWBDzcpBHqreg
definition: This industry comprises establishments primarily engaged in retailing used automobiles and light trucks, such as sport utility vehicles, and passenger and cargo vans.
example: Antique auto dealers
example: Automobile dealers, used only
example: Light truck dealers, used only