Mobile Food Services
type: Class
subclass of: iFgJwLD8TVCnTgHg1Aj4WQ
definition: This industry comprises establishments primarily engaged in preparing and serving meals and snacks for immediate consumption from motorized vehicles or nonmotorized carts. The establishment is the central location from which the caterer route is serviced, not each vehicle or cart. Included in this industry are establishments primarily engaged in providing food services from vehicles, such as hot dog carts and ice cream trucks.
example: Ice cream truck vendors
example: Mobile canteens
example: Mobile food carts and trucks
example: Mobile food concession stands
example: Mobile refreshment stands
example: Mobile snack stands