Other Consumer Goods Rental
type: Class
subclass of: 1n8WzhIBRJuB796TVihXfg
definition: This industry comprises establishments primarily engaged in renting consumer goods (except consumer electronics and appliances).
example: Costume rental
example: Formal wear rental
example: Furniture (i.e., residential) rental centers
example: Hospital bed rental and leasing (i.e., home use)
example: Party rental supply centers
example: Sporting goods rental
example: Video disc rental for home electronic equipment (e.g., DVD)