Other Communications Equipment Manufacturing
type: Class
subclass of: RqEfdxrbSOuwtX8UpCmNAw
definition: This industry comprises establishments primarily engaged in manufacturing communications equipment (except telephone apparatus, radio and television broadcast equipment, and wireless communications equipment).
example: Fire detection and alarm systems manufacturing
example: Intercom systems and equipment manufacturing
example: Signals (e.g., highway, pedestrian, railway, traffic) manufacturing
example: Video-based stadium displays manufacturing