General Freight Trucking
type: Class
subclass of: RBvXYVuffq7XXEmGpCJ0vCx
definition: This industry group comprises establishments primarily engaged in providing general freight trucking. General freight trucking establishments handle a wide variety of commodities, generally palletized, and transported in a container or van trailer. The establishments of this industry group provide a combination of the following network activities: local pick-up, local sorting and terminal operations, line-haul, destination sorting and terminal operations, and local delivery.