Jewelry and Silverware Manufacturing
type: Class
subclass of: Mb5ZG3ohSKqy9TTSRAVlTg
definition: This industry comprises establishments primarily engaged in one or more of the following: (1) manufacturing, engraving, chasing, or etching fine and costume jewelry; (2) manufacturing, engraving, chasing, or etching metal personal goods (i.e., small articles carried on or about the person, such as compacts or cigarette cases); (3) manufacturing, engraving, chasing, or etching precious metal solid, precious metal clad, or pewter flatware and other hollowware; (4) stamping coins; (5) manufacturing unassembled jewelry parts and stock shop products, such as sheet, wire, and tubing; (6) cutting, slabbing, tumbling, carving, engraving, polishing, or faceting precious or semiprecious stones and gems; (7) recutting, repolishing, and setting gem stones; and (8) drilling, sawing, and peeling cultured and costume pearls. This industry includes establishments primarily engaged in manufacturing precious solid, precious clad, and precious plated jewelry and personal goods.