Residential Intellectual and Developmental Disability Facilities
type: Class
subclass of: XAFwVKQlRkiT7UHYjAYbJA
definition: This industry comprises establishments (e.g., group homes, hospitals, intermediate care facilities) primarily engaged in providing residential care services for persons with intellectual and developmental disabilities. These facilities may provide some health care, though the focus is room, board, protective supervision, and counseling.