Rubber Product Manufacturing
type: Class
subclass of: qTC5T9b0ROGfouRf0ZJ1ZQ
definition: This industry group comprises establishments primarily engaged in processing natural, synthetic, or reclaimed rubber materials into intermediate or final products using processes, such as vulcanizing, cementing, molding, extruding, and lathe-cutting.