Ground or Treated Mineral and Earth Manufacturing
type: Class
subclass of: JhRFfbpGQvibW3Os07qUcQ
definition: This U.S. industry comprises establishments primarily engaged in calcining, dead burning, or otherwise processing beyond beneficiation, clays, ceramic and refractory minerals, barite, and miscellaneous nonmetallic minerals.