Refrigerated Warehousing and Storage
type: Class
subclass of: OGNgHfhCRNegpBNp9J0fwg
definition: This industry comprises establishments primarily engaged in operating refrigerated warehousing and storage facilities. Establishments primarily engaged in the storage of furs for the trade are included in this industry. The services provided by these establishments include blast freezing, tempering, and modified atmosphere storage services.