Semiconductor and Related Device Manufacturing
type: Class
subclass of: h3GjRS3mT76GlOkN0SlOrg
definition: This U.S. industry comprises establishments primarily engaged in manufacturing semiconductors and related solid-state devices. Examples of products made by these establishments are integrated circuits, memory chips, microprocessors, diodes, transistors, solar cells, and other optoelectronic devices.