Wired and Wireless Telecommunications Carriers (except Satellite)
type: Class
subclass of: enRP4jnPSoK2T97JxxW dw
definition: This industry comprises establishments primarily engaged in operating, maintaining, and/or providing access to switching and transmission facilities and infrastructure that they own and/or lease for the transmission of voice, data, text, sound, and video using wired and wireless telecommunications networks (except satellite). Transmission facilities may be based on a single technology or a combination of technologies. By exception, establishments providing satellite television distribution services using facilities and infrastructure that they operate are included in this industry.
example: Broadband Internet service providers, wired (e.g., cable, DSL)
example: Cable television distribution services
example: Cellular telephone service carriers
example: Direct-to-home satellite system (DTH) services
example: Satellite television distribution systems
example: Telecommunications carriers, wired and wireless
example: VoIP service providers, using own operated wired telecommunications infrastructure
example: Wireless Internet service providers, except satellite
example: Wireless telecommunications carriers, except satellite
example: Wireless telephone communications carriers, except satellite