Agents and Managers for Artists, Athletes, Entertainers, and Other Public Figures
type: Class
subclass of: VgA6rX00RRemI1dqDNJo4w
definition: This industry comprises establishments of agents and managers primarily engaged in representing and/or managing creative and performing artists, sports figures, entertainers, and other public figures. The representation and management includes activities, such as representing clients in contract negotiations; managing or organizing clients' financial affairs; and generally promoting the careers of their clients.
example: Celebrities' agents or managers
example: Literary agents
example: Modeling agents
example: Sports figures' agents or managers
example: Talent agents