Environmental Consulting Services
type: Class
subclass of: iC2RrcU-SE2c2SFuttl6Og
definition: This industry comprises establishments primarily engaged in providing advice and assistance to businesses and other organizations on environmental issues, such as the control of environmental contamination from pollutants, toxic substances, and hazardous materials. These establishments identify problems (e.g., inspect buildings for hazardous materials), measure and evaluate risks, and recommend solutions. They employ a multidisciplined staff of scientists, engineers, and other technicians with expertise in areas, such as air and water quality, asbestos contamination, remediation, ecological restoration, and environmental law. Establishments providing sanitation or site remediation consulting services are included in this industry.